{"text_format":"1","workbook":"xlsx","n_sheets":4,"sheets":["Simulation retraite","Détails projection","Préfinancement","Para_simu"],"not_rendered":{"charts":0,"images":2,"macros":1,"external_links":2,"defined_names":22,"comments":0,"pivot_tables":0},"unopened":[],"bounds":{"document_bytes":16777216,"sheet_cells":100000,"rows_first":2000,"rows_last":500,"rows_between":2000,"halvings":0,"cell_chars":16384,"cell_head_chars":4096},"cells_cut":0,"cells_raw":0,"read":"whole","date_system":"1900"}

{"sheet":"Simulation retraite","index":0,"n_rows":63,"n_cols":10,"rows_kept":63,"cut":false,"hidden":false,"merged":[[1,0,1,3],[3,0,3,3],[32,0,32,3],[62,0,62,3],[60,0,60,3]]}
[]
["Simulateur de prestations"]
[null,null,null,null,null,null,"Calcul à 1.75% à la date de retraite"]
["Données de base (remplir uniquement les cases grisées)",null,null,null,null,null,"Préfinancement",{"$f":"B$41","v":0.01},{"$f":"C$41","v":1.7500000000000002E-2},{"$f":"D$41","v":2.5000000000000001E-2}]
["Informations personnelles au","2021-01-01",{"$f":"IF(OR(DAY(B5)<>1,MONTH(B5)<>1),\"**\",\"\")","v":""},null,null,null,"KRAV",{"$f":"MIN(B43,IF(B8=\"Base\",(B28*E29),(B28-($F$25*2)/E30)*E29))","v":0},{"$f":"MIN(C43,IF(B8=\"Base\",(B28*E29),(B28-($F$25*2)/E30)*E29))","v":0},{"$f":"MIN(D43,IF(B8=\"Base\",(B28*E29),(B28-($F$25*2)/E30)*E29))","v":0}]
["Date de naissance","1960-02-01",null,null,null,null,"RAV_fin",{"$f":"IF(E29=0,0,H5/E29)","v":0},{"$f":"IF(E29=0,0,I5/E29)","v":0},{"$f":"IF(E29=0,0,J5/E29)","v":0}]
{"$rows_left_out":58}
{"sheet":"Détails projection","index":1,"n_rows":54,"n_cols":44,"rows_kept":54,"cut":false,"hidden":true,"merged":[]}
["Détails avoir vieillesse",null,null,"Taux 1",null,null,null,null,"Détails apports",null,null,null,{"$f":"'Simulation retraite'!H44","v":0},null,null,"Détails avoir vieillesse",null,null,"Taux 2",null,null,null,null,"Détails apports",null,null,null,1.7500000000000002E-2,null,null,"Détails avoir vieillesse",null,null,"Taux 3",null,null,null,null,"Détails apports",null,null,null,2.5000000000000001E-2]
["Date","Age LPP","Nb jours","Intérêts","Taux de bonif","Montant bonif","Avoir vieillesse sans intérêt","Avoir vieillesse","Date","Age LPP","Nb jours","Intérêts","Apport","Somme bonif futures",null,"Date","Age LPP","Nb jours","Intérêts","Taux de bonif","Montant bonif","Avoir vieillesse sans intérêt","Avoir vieillesse","Date","Age LPP","Nb jours","Intérêts","Apport","Somme bonif futures",null,"Date","Age LPP","Nb jours","Intérêts","Taux de bonif","Montant bonif","Avoir vieillesse sans intérêt","Avoir vieillesse","Date","Age LPP","Nb jours","Intérêts","Apport","Somme bonif futures"]
[]
[{"$f":"'Simulation retraite'!$B$5","v":"2021-01-01"},null,null,null,null,null,{"$f":"'Simulation retraite'!$B$11","v":400000},{"$f":"'Simulation retraite'!$B$11","v":400000},{"$f":"'Simulation retraite'!$B$20","v":"00:00:00"},null,null,null,{"$f":"IF('Simulation retraite'!$B$20=0,0,'Simulation retraite'!$B$21)","v":0},null,null,{"$f":"'Simulation retraite'!$B$5","v":"2021-01-01"},null,null,null,null,null,{"$f":"'Simulation retraite'!$B$11","v":400000},{"$f":"'Simulation retraite'!$B$11","v":400000},{"$f":"'Simulation retraite'!$B$20","v":"00:00:00"},null,null,null,{"$f":"IF('Simulation retraite'!$B$20=0,0,'Simulation retraite'!$B$21)","v":0},null,null,{"$f":"'Simulation retraite'!$B$5","v":"2021-01-01"},null,null,null,null,null,{"$f":"'Simulation retraite'!$B$11","v":400000},{"$f":"'Simulation retraite'!$B$11","v":400000},{"$f":"'Simulation retraite'!$B$20","v":"00:00:00"},null,null,null,{"$f":"IF('Simulation retraite'!$B$20=0,0,'Simulation retraite'!$B$21)","v":0}]
[{"$f":"IF(A4=\"\",\"\",IF(YEAR('Simulation retraite'!$B$24)=YEAR(A4),'Simulation retraite'!$B$24,IF(YEAR('Simulation retraite'!$B$24)-1<YEAR(A4),\"\",EOMONTH(A4,(12-MONTH(A4))))))","v":"2021-12-31"},{"$f":"IF(A5=\"\",\"\",YEAR(A5)-YEAR('Simulation retraite'!$B$6))","v":61},{"$f":"IF(AND(DAY(A5)=1,YEAR(A5)<>YEAR('Simulation retraite'!$B$24)),DAYS360(A4,A5)-1,DAYS360(A4,A5))","v":360},{"$f":"IF(A5=\"\",\"\",IF(YEAR(A5)=2019,CEILING(Para_simu!$Q$2*H4*C5/360,0.05),IF(YEAR(A5)=2020,CEILING(H4*Para_simu!$Q$3*C5/360,0.05),IF(YEAR(A5)=2021,CEILING(H4*Para_simu!$Q$4*C5/360,0.05),IF(YEAR(A5)=2022,CEILING(H4*Para_simu!$Q$5*C5/360,0.05),CEILING(H4*'Simulation retraite'!$B$41*C5/360,0.05))))))","v":20000},{"$f":"IF(A5=\"\",\"\",IF(OR('Simulation retraite'!$B$9=\"non\",YEAR(A5)<=2021),IF(YEAR(A5)<2024,IF('Simulation retraite'!$B$8=\"Base\",VLOOKUP(B5,Para_simu!$A$1:$I$55,2,FALSE),VLOOKUP(B5,Para_simu!$A$1:$I$55,3,FALSE)),IF('Simulation retraite'!$B$8=\"Base\",VLOOKUP(B5,Para_simu!$A$1:$I$55,4,FALSE),VLOOKUP(B5,Para_simu!$A$1:$I$55,5,FALSE))),IF(YEAR(A5)<2024,IF('Simulation retraite'!$B$8=\"Base\",VLOOKUP(B5,Para_simu!$A$1:$I$55,6,FALSE),VLOOKUP(B5,Para_simu!$A$1:$I$55,7,FALSE)),IF('Simulation retraite'!$B$8=\"Base\",VLOOKUP(B5,Para_simu!$A$1:$I$55,8,FALSE),VLOOKUP(B5,Para_simu!$A$1:$I$55,9,FALSE)))))","v":0.215},{"$f":"CEILING(E5*'Simulation retraite'!$B$10/12,0.05)*12*(C5/360)","v":16125},{"$f":"IF(A5=\"\",\"\",CEILING(G4+F5,0.05))","v":416125},{"$f":"IF(A5=\"\",\"\",CEILING(H4+D5+F5,0.05))","v":436125},{"$f":"IF(I4=\"\",\"\",IF(YEAR('Simulation retraite'!$B$24)=YEAR(I4),'Simulation retraite'!$B$24,IF(YEAR('Simulation retraite'!$B$24)-1<YEAR(I4),\"\",EOMONTH(I4,(12-MONTH(I4))))))","v":"1900-12-31"},{"$f":"IF(I5=\"\",\"\",YEAR(I5)-YEAR('Simulation retraite'!$B$6))","v":-60},{"$f":"IF(AND(DAY(I5)=1,YEAR(I5)<>YEAR('Simulation retraite'!$B$24)),DAYS360(I4,I5)-1,DAYS360(I4,I5))","v":361},{"$f":"IF(I5=\"\",\"\",IF(YEAR(I5)=2019,CEILING(M4*Para_simu!$Q$2*K5/360,0.05),IF(YEAR(I5)=2020,CEILING(M4*Para_simu!$Q$3*K5/360,0.05),IF(YEAR(I5)=2021,CEILING(M4*Para_simu!$Q$4*K5/360,0.05),IF(YEAR(I5)=2022,CEILING(M4*Para_simu!$Q$5*K5/360,0.05),CEILING(M4*'Simulation retraite'!$B$41*K5/360,0.05))))))","v":0},{"$f":"IF(I5=\"\",\"\",M4+L5)","v":0},{"$f":"IF(A5=\"\",\"\",E5*C5/360)","v":0.21500000000000002},null,{"$f":"IF(P4=\"\",\"\",IF(YEAR('Simulation retraite'!$B$24)=YEAR(P4),'Simulation retraite'!$B$24,IF(YEAR('Simulation retraite'!$B$24)-1<YEAR(P4),\"\",EOMONTH(P4,(12-MONTH(P4))))))","v":"2021-12-31"},{"$f":"IF(P5=\"\",\"\",YEAR(P5)-YEAR('Simulation retraite'!$B$6))","v":61},{"$f":"IF(AND(DAY(P5)=1,YEAR(P5)<>YEAR('Simulation retraite'!$B$24)),DAYS360(P4,P5)-1,DAYS360(P4,P5))","v":360},{"$f":"IF(P5=\"\",\"\",IF(YEAR(P5)=2019,CEILING(Para_simu!$Q$2*W4*R5/360,0.05),IF(YEAR(P5)=2020,CEILING(W4*Para_simu!$Q$3*R5/360,0.05),IF(YEAR(P5)=2021,CEILING(W4*Para_simu!$Q$4*R5/360,0.05),IF(YEAR(P5)=2022,CEILING(W4*Para_simu!$Q$5*R5/360,0.05),CEILING(W4*'Simulation retraite'!$C$41*R5/360,0.05))))))","v":20000},{"$f":"IF(P5=\"\",\"\",IF(OR('Simulation retraite'!$B$9=\"non\",YEAR(P5)<=2021),IF(YEAR(P5)<2024,IF('Simulation retraite'!$B$8=\"Base\",VLOOKUP(Q5,Para_simu!$A$1:$I$55,2,FALSE),VLOOKUP(Q5,Para_simu!$A$1:$I$55,3,FALSE)),IF('Simulation retraite'!$B$8=\"Base\",VLOOKUP(Q5,Para_simu!$A$1:$I$55,4,FALSE),VLOOKUP(Q5,Para_simu!$A$1:$I$55,5,FALSE))),IF(YEAR(P5)<2024,IF('Simulation retraite'!$B$8=\"Base\",VLOOKUP(Q5,Para_simu!$A$1:$I$55,6,FALSE),VLOOKUP(Q5,Para_simu!$A$1:$I$55,7,FALSE)),IF('Simulation retraite'!$B$8=\"Base\",VLOOKUP(Q5,Para_simu!$A$1:$I$55,8,FALSE),VLOOKUP(Q5,Para_simu!$A$1:$I$55,9,FALSE)))))","v":0.215},{"$f":"CEILING(T5*'Simulation retraite'!$B$10/12,0.05)*12*(R5/360)","v":16125},{"$f":"IF(P5=\"\",\"\",CEILING(V4+U5,0.05))","v":416125},{"$f":"IF(P5=\"\",\"\",CEILING(W4+S5+U5,0.05))","v":436125},{"$f":"IF(X4=\"\",\"\",IF(YEAR('Simulation retraite'!$B$24)=YEAR(X4),'Simulation retraite'!$B$24,IF(YEAR('Simulation retraite'!$B$24)-1<YEAR(X4),\"\",EOMONTH(X4,(12-MONTH(X4))))))","v":"1900-12-31"},{"$f":"IF(X5=\"\",\"\",YEAR(X5)-YEAR('Simulation retraite'!$B$6))","v":-60},{"$f":"IF(AND(DAY(X5)=1,YEAR(X5)<>YEAR('Simulation retraite'!$B$24)),DAYS360(X4,X5)-1,DAYS360(X4,X5))","v":361},{"$f":"IF(X5=\"\",\"\",IF(YEAR(X5)=2019,CEILING(AB4*Para_simu!$Q$2*Z5/360,0.05),IF(YEAR(X5)=2020,CEILING(AB4*Para_simu!$Q$3*Z5/360,0.05),IF(YEAR(X5)=2021,CEILING(AB4*Para_simu!$Q$4*Z5/360,0.05),IF(YEAR(X5)=2022,CEILING(AB4*Para_simu!$Q$5*Z5/360,0.05),CEILING(AB4*'Simulation retraite'!$C$41*Z5/360,0.05))))))","v":0},{"$f":"IF(X5=\"\",\"\",AB4+AA5)","v":0},{"$f":"IF(P5=\"\",\"\",T5)","v":0.215},null,{"$f":"IF(AE4=\"\",\"\",IF(YEAR('Simulation retraite'!$B$24)=YEAR(AE4),'Simulation retraite'!$B$24,IF(YEAR('Simulation retraite'!$B$24)-1<YEAR(AE4),\"\",EOMONTH(AE4,(12-MONTH(AE4))))))","v":"2021-12-31"},{"$f":"IF(AE5=\"\",\"\",YEAR(AE5)-YEAR('Simulation retraite'!$B$6))","v":61},{"$f":"IF(AND(DAY(AE5)=1,YEAR(AE5)<>YEAR('Simulation retraite'!$B$24)),DAYS360(AE4,AE5)-1,DAYS360(AE4,AE5))","v":360},{"$f":"IF(AE5=\"\",\"\",IF(YEAR(AE5)=2019,CEILING(Para_simu!$Q$2*AL4*AG5/360,0.05),IF(YEAR(AE5)=2020,CEILING(AL4*Para_simu!$Q$3*AG5/360,0.05),IF(YEAR(AE5)=2021,CEILING(AL4*Para_simu!$Q$4*AG5/360,0.05),IF(YEAR(AE5)=2022,CEILING(AL4*Para_simu!$Q$5*AG5/360,0.05),CEILING(AL4*'Simulation retraite'!$D$41*AG5/360,0.05))))))","v":20000},{"$f":"IF(AE5=\"\",\"\",IF(OR('Simulation retraite'!$B$9=\"non\",YEAR(AE5)<=2021),IF(YEAR(AE5)<2024,IF('Simulation retraite'!$B$8=\"Base\",VLOOKUP(AF5,Para_simu!$A$1:$I$55,2,FALSE),VLOOKUP(AF5,Para_simu!$A$1:$I$55,3,FALSE)),IF('Simulation retraite'!$B$8=\"Base\",VLOOKUP(AF5,Para_simu!$A$1:$I$55,4,FALSE),VLOOKUP(AF5,Para_simu!$A$1:$I$55,5,FALSE))),IF(YEAR(AE5)<2024,IF('Simulation retraite'!$B$8=\"Base\",VLOOKUP(AF5,Para_simu!$A$1:$I$55,6,FALSE),VLOOKUP(AF5,Para_simu!$A$1:$I$55,7,FALSE)),IF('Simulation retraite'!$B$8=\"Base\",VLOOKUP(AF5,Para_simu!$A$1:$I$55,8,FALSE),VLOOKUP(AF5,Para_simu!$A$1:$I$55,9,FALSE)))))","v":0.215},{"$f":"CEILING(AI5*'Simulation retraite'!$B$10/12,0.05)*12*(AG5/360)","v":16125},{"$f":"IF(AE5=\"\",\"\",CEILING(AK4+AJ5,0.05))","v":416125},{"$f":"IF(AE5=\"\",\"\",CEILING(AL4+AH5+AJ5,0.05))","v":436125},{"$f":"IF(AM4=\"\",\"\",IF(YEAR('Simulation retraite'!$B$24)=YEAR(AM4),'Simulation retraite'!$B$24,IF(YEAR('Simulation retraite'!$B$24)-1<YEAR(AM4),\"\",EOMONTH(AM4,(12-MONTH(AM4))))))","v":"1900-12-31"},{"$f":"IF(AM5=\"\",\"\",YEAR(AM5)-YEAR('Simulation retraite'!$B$6))","v":-60},{"$f":"IF(AND(DAY(AM5)=1,YEAR(AM5)<>YEAR('Simulation retraite'!$B$24)),DAYS360(AM4,AM5)-1,DAYS360(AM4,AM5))","v":361},{"$f":"IF(AM5=\"\",\"\",IF(YEAR(AM5)=2019,CEILING(AQ4*Para_simu!$Q$2*AO5/360,0.05),IF(YEAR(AM5)=2020,CEILING(AQ4*Para_simu!$Q$3*AO5/360,0.05),IF(YEAR(AM5)=2021,CEILING(AQ4*Para_simu!$Q$4*AO5/360,0.05),IF(YEAR(AM5)=2022,CEILING(AQ4*Para_simu!$Q$5*AO5/360,0.05),CEILING(AQ4*'Simulation retraite'!$D$41*AO5/360,0.05))))))","v":0},{"$f":"IF(AM5=\"\",\"\",AQ4+AP5)","v":0},{"$f":"IF(AE5=\"\",\"\",AI5)","v":0.215}]
[{"$f":"IF(A5=\"\",\"\",IF(YEAR('Simulation retraite'!$B$24)-1=YEAR(A5),'Simulation retraite'!$B$24,IF(YEAR('Simulation retraite'!$B$24)-1<YEAR(A5),\"\",(EDATE(A5,12)))))","v":"2022-12-31"},{"$f":"IF(A6=\"\",\"\",YEAR(A6)-YEAR('Simulation retraite'!$B$6))","v":62},{"$f":"IF(A6=\"\",\"\",IF(DAY(A6)=1,DAYS360(A5,A6)-1,DAYS360(A5,A6)))","v":360},{"$f":"IF(A6=\"\",\"\",IF(YEAR(A6)=2019,CEILING(Para_simu!$Q$2*H5*C6/360,0.05),IF(YEAR(A6)=2020,CEILING(H5*Para_simu!$Q$3*C6/360,0.05),IF(YEAR(A6)=2021,CEILING(H5*Para_simu!$Q$4*C6/360,0.05),IF(YEAR(A6)=2022,CEILING(H5*Para_simu!$Q$5*C6/360,0.05),CEILING(H5*'Simulation retraite'!$B$41*C6/360,0.05))))))","v":4361.25},{"$f":"IF(A6=\"\",\"\",IF(OR('Simulation retraite'!$B$9=\"non\",YEAR(A6)<=2021),IF(YEAR(A6)<2024,IF('Simulation retraite'!$B$8=\"Base\",VLOOKUP(B6,Para_simu!$A$1:$I$55,2,FALSE),VLOOKUP(B6,Para_simu!$A$1:$I$55,3,FALSE)),IF('Simulation retraite'!$B$8=\"Base\",VLOOKUP(B6,Para_simu!$A$1:$I$55,4,FALSE),VLOOKUP(B6,Para_simu!$A$1:$I$55,5,FALSE))),IF(YEAR(A6)<2024,IF('Simulation retraite'!$B$8=\"Base\",VLOOKUP(B6,Para_simu!$A$1:$I$55,6,FALSE),VLOOKUP(B6,Para_simu!$A$1:$I$55,7,FALSE)),IF('Simulation retraite'!$B$8=\"Base\",VLOOKUP(B6,Para_simu!$A$1:$I$55,8,FALSE),VLOOKUP(B6,Para_simu!$A$1:$I$55,9,FALSE)))))","v":0.22500000000000001},{"$f":"IF(A6=\"\",\"\",CEILING(E6*'Simulation retraite'!$B$10/12,0.05)*12*(C6/360))","v":16875},{"$f":"IF(A6=\"\",\"\",CEILING(G5+F6,0.05))","v":433000},457361.25,{"$f":"IF(I5=\"\",\"\",IF(YEAR('Simulation retraite'!$B$24)-1=YEAR(I5),'Simulation retraite'!$B$24,IF(YEAR('Simulation retraite'!$B$24)-1<YEAR(I5),\"\",(EDATE(I5,12)))))","v":"1901-12-31"},{"$f":"IF(I6=\"\",\"\",YEAR(I6)-YEAR('Simulation retraite'!$B$6))","v":-59},{"$f":"IF(I6=\"\",\"\",IF(DAY(I6)=1,DAYS360(I5,I6)-1,DAYS360(I5,I6)))","v":360},{"$f":"IF(I6=\"\",\"\",IF(YEAR(I6)=2020,CEILING(M5*Para_simu!$Q$3*K6/360,0.05),IF(YEAR(I6)=2021,CEILING(M5*Para_simu!$Q$4*K6/360,0.05),IF(YEAR(I6)=2022,CEILING(M5*Para_simu!$Q$5*K6/360,0.05),CEILING(M5*'Simulation retraite'!$B$41*K6/360,0.05)))))","v":0},{"$f":"IF(I6=\"\",\"\",M5+L6)","v":0},{"$f":"IF(A6=\"\",\"\",ROUND(N5+N5*($M$1*C6/360)+E6*C6/360,6))","v":0.44},null,{"$f":"IF(P5=\"\",\"\",IF(YEAR('Simulation retraite'!$B$24)-1=YEAR(P5),'Simulation retraite'!$B$24,IF(YEAR('Simulation retraite'!$B$24)-1<YEAR(P5),\"\",(EDATE(P5,12)))))","v":"2022-12-31"},{"$f":"IF(P6=\"\",\"\",YEAR(P6)-YEAR('Simulation retraite'!$B$6))","v":62},{"$f":"IF(P6=\"\",\"\",IF(DAY(P6)=1,DAYS360(P5,P6)-1,DAYS360(P5,P6)))","v":360},{"$f":"IF(P6=\"\",\"\",IF(YEAR(P6)=2019,CEILING(Para_simu!$Q$2*W5*R6/360,0.05),IF(YEAR(P6)=2020,CEILING(W5*Para_simu!$Q$3*R6/360,0.05),IF(YEAR(P6)=2021,CEILING(W5*Para_simu!$Q$4*R6/360,0.05),IF(YEAR(P6)=2022,CEILING(W5*Para_simu!$Q$5*R6/360,0.05),CEILING(W5*'Simulation retraite'!$C$41*R6/360,0.05))))))","v":4361.25},{"$f":"IF(P6=\"\",\"\",IF(OR('Simulation retraite'!$B$9=\"non\",YEAR(P6)<=2021),IF(YEAR(P6)<2024,IF('Simulation retraite'!$B$8=\"Base\",VLOOKUP(Q6,Para_simu!$A$1:$I$55,2,FALSE),VLOOKUP(Q6,Para_simu!$A$1:$I$55,3,FALSE)),IF('Simulation retraite'!$B$8=\"Base\",VLOOKUP(Q6,Para_simu!$A$1:$I$55,4,FALSE),VLOOKUP(Q6,Para_simu!$A$1:$I$55,5,FALSE))),IF(YEAR(P6)<2024,IF('Simulation retraite'!$B$8=\"Base\",VLOOKUP(Q6,Para_simu!$A$1:$I$55,6,FALSE),VLOOKUP(Q6,Para_simu!$A$1:$I$55,7,FALSE)),IF('Simulation retraite'!$B$8=\"Base\",VLOOKUP(Q6,Para_simu!$A$1:$I$55,8,FALSE),VLOOKUP(Q6,Para_simu!$A$1:$I$55,9,FALSE)))))","v":0.22500000000000001},{"$f":"IF(P6=\"\",\"\",CEILING(T6*'Simulation retraite'!$B$10/12,0.05)*12*(R6/360))","v":16875},433000,457361.25,{"$f":"IF(X5=\"\",\"\",IF(YEAR('Simulation retraite'!$B$24)-1=YEAR(X5),'Simulation retraite'!$B$24,IF(YEAR('Simulation retraite'!$B$24)-1<YEAR(X5),\"\",(EDATE(X5,12)))))","v":"1901-12-31"},{"$f":"IF(X6=\"\",\"\",YEAR(X6)-YEAR('Simulation retraite'!$B$6))","v":-59},{"$f":"IF(X6=\"\",\"\",IF(DAY(X6)=1,DAYS360(X5,X6)-1,DAYS360(X5,X6)))","v":360},{"$f":"IF(X6=\"\",\"\",IF(YEAR(X6)=2020,CEILING(AB5*Para_simu!$Q$3*Z6/360,0.05),IF(YEAR(X6)=2021,CEILING(AB5*Para_simu!$Q$4*Z6/360,0.05),IF(YEAR(X6)=2022,CEILING(AB5*Para_simu!$Q$5*Z6/360,0.05),CEILING(AB5*'Simulation retraite'!$C$41*Z6/360,0.05)))))","v":0},0,{"$f":"IF(P6=\"\",\"\",ROUND(AC5+AC5*($AB$1*R6/360)+T6*R6/360,6))","v":0.44376300000000002},null,{"$f":"IF(AE5=\"\",\"\",IF(YEAR('Simulation retraite'!$B$24)-1=YEAR(AE5),'Simulation retraite'!$B$24,IF(YEAR('Simulation retraite'!$B$24)-1<YEAR(AE5),\"\",(EDATE(AE5,12)))))","v":"2022-12-31"},{"$f":"IF(AE6=\"\",\"\",YEAR(AE6)-YEAR('Simulation retraite'!$B$6))","v":62},{"$f":"IF(AE6=\"\",\"\",IF(DAY(AE6)=1,DAYS360(AE5,AE6)-1,DAYS360(AE5,AE6)))","v":360},{"$f":"IF(AE6=\"\",\"\",IF(YEAR(AE6)=2019,CEILING(Para_simu!$Q$2*AL5*AG6/360,0.05),IF(YEAR(AE6)=2020,CEILING(AL5*Para_simu!$Q$3*AG6/360,0.05),IF(YEAR(AE6)=2021,CEILING(AL5*Para_simu!$Q$4*AG6/360,0.05),IF(YEAR(AE6)=2022,CEILING(AL5*Para_simu!$Q$5*AG6/360,0.05),CEILING(AL5*'Simulation retraite'!$D$41*AG6/360,0.05))))))","v":4361.25},{"$f":"IF(AE6=\"\",\"\",IF(OR('Simulation retraite'!$B$9=\"non\",YEAR(AE6)<=2021),IF(YEAR(AE6)<2024,IF('Simulation retraite'!$B$8=\"Base\",VLOOKUP(AF6,Para_simu!$A$1:$I$55,2,FALSE),VLOOKUP(AF6,Para_simu!$A$1:$I$55,3,FALSE)),IF('Simulation retraite'!$B$8=\"Base\",VLOOKUP(AF6,Para_simu!$A$1:$I$55,4,FALSE),VLOOKUP(AF6,Para_simu!$A$1:$I$55,5,FALSE))),IF(YEAR(AE6)<2024,IF('Simulation retraite'!$B$8=\"Base\",VLOOKUP(AF6,Para_simu!$A$1:$I$55,6,FALSE),VLOOKUP(AF6,Para_simu!$A$1:$I$55,7,FALSE)),IF('Simulation retraite'!$B$8=\"Base\",VLOOKUP(AF6,Para_simu!$A$1:$I$55,8,FALSE),VLOOKUP(AF6,Para_simu!$A$1:$I$55,9,FALSE)))))","v":0.22500000000000001},{"$f":"IF(AE6=\"\",\"\",CEILING(AI6*'Simulation retraite'!$B$10/12,0.05)*12*(AG6/360))","v":16875},433000,457361.25,{"$f":"IF(AM5=\"\",\"\",IF(YEAR('Simulation retraite'!$B$24)-1=YEAR(AM5),'Simulation retraite'!$B$24,IF(YEAR('Simulation retraite'!$B$24)-1<YEAR(AM5),\"\",(EDATE(AM5,12)))))","v":"1901-12-31"},{"$f":"IF(AM6=\"\",\"\",YEAR(AM6)-YEAR('Simulation retraite'!$B$6))","v":-59},{"$f":"IF(AM6=\"\",\"\",IF(DAY(AM6)=1,DAYS360(AM5,AM6)-1,DAYS360(AM5,AM6)))","v":360},{"$f":"IF(AM6=\"\",\"\",IF(YEAR(AM6)=2020,CEILING(AQ5*Para_simu!$Q$3*AO6/360,0.05),IF(YEAR(AM6)=2021,CEILING(AQ5*Para_simu!$Q$4*AO6/360,0.05),IF(YEAR(AM6)=2022,CEILING(AQ5*Para_simu!$Q$5*AO6/360,0.05),CEILING(AQ5*'Simulation retraite'!$D$41*AO6/360,0.05)))))","v":0},0,{"$f":"IF(AE6=\"\",\"\",ROUND(AR5+AR5*($AQ$1*AG6/360)+AI6*AG6/360,6))","v":0.44537500000000002}]
{"$rows_left_out":49}
{"sheet":"Préfinancement","index":2,"n_rows":54,"n_cols":14,"rows_kept":54,"cut":false,"hidden":true,"merged":[]}
["Préfinancement",null,null,{"$f":"'Simulation retraite'!B41","v":0.01},null,"Préfinancement",null,null,{"$f":"'Simulation retraite'!C41","v":1.7500000000000002E-2},null,"Préfinancement",null,null,{"$f":"'Simulation retraite'!D41","v":2.5000000000000001E-2}]
["Date","Nb jours","Intérêts","Préfinancement",null,"Date","Nb jours","Intérêts","Préfinancement",null,"Date","Nb jours","Intérêts","Préfinancement"]
[]
[{"$f":"'Simulation retraite'!$B$5","v":"2021-01-01"},null,null,{"$f":"'Simulation retraite'!$B$12","v":0},null,{"$f":"'Simulation retraite'!$B$5","v":"2021-01-01"},null,null,{"$f":"'Simulation retraite'!$B$12","v":0},null,{"$f":"'Simulation retraite'!$B$5","v":"2021-01-01"},null,null,{"$f":"'Simulation retraite'!$B$12","v":0}]
[{"$f":"IF(A4=\"\",\"\",IF(YEAR('Simulation retraite'!$B$24)=YEAR(A4),'Simulation retraite'!$B$24,IF(YEAR('Simulation retraite'!$B$24)-1<YEAR(A4),\"\",EOMONTH(A4,(12-MONTH(A4))))))","v":"2021-12-31"},{"$f":"IF(AND(DAY(A5)=1,YEAR(A5)<>YEAR('Simulation retraite'!$B$24)),DAYS360(A4,A5)-1,DAYS360(A4,A5))","v":360},{"$f":"IF(A5=\"\",\"\",IF(YEAR(A5)=2019,CEILING(D4*Para_simu!$Q$2*B5/360,0.05),IF(YEAR(A5)=2020,CEILING(D4*Para_simu!$Q$3*B5/360,0.05),IF(YEAR(A5)=2021,CEILING(D4*Para_simu!$Q$4*B5/360,0.05),IF(YEAR(A5)=2022,CEILING(D4*Para_simu!$Q$5*B5/360,0.05),CEILING(D4*'Simulation retraite'!$B$41*B5/360,0.05))))))","v":0},{"$f":"IF(A5=\"\",\"\",D4+C5)","v":0},null,{"$f":"IF(F4=\"\",\"\",IF(YEAR('Simulation retraite'!$B$24)=YEAR(F4),'Simulation retraite'!$B$24,IF(YEAR('Simulation retraite'!$B$24)-1<YEAR(F4),\"\",EOMONTH(F4,(12-MONTH(F4))))))","v":"2021-12-31"},{"$f":"IF(AND(DAY(F5)=1,YEAR(F5)<>YEAR('Simulation retraite'!$B$24)),DAYS360(F4,F5)-1,DAYS360(F4,F5))","v":360},{"$f":"IF(F5=\"\",\"\",IF(YEAR(F5)=2019,CEILING(I4*Para_simu!$Q$2*G5/360,0.05),IF(YEAR(F5)=2020,CEILING(I4*Para_simu!$Q$3*G5/360,0.05),IF(YEAR(F5)=2021,CEILING(I4*Para_simu!$Q$4*G5/360,0.05),IF(YEAR(F5)=2022,CEILING(I4*Para_simu!$Q$5*G5/360,0.05),CEILING(I4*'Simulation retraite'!$C$41*G5/360,0.05))))))","v":0},{"$f":"IF(F5=\"\",\"\",I4+H5)","v":0},null,{"$f":"IF(K4=\"\",\"\",IF(YEAR('Simulation retraite'!$B$24)=YEAR(K4),'Simulation retraite'!$B$24,IF(YEAR('Simulation retraite'!$B$24)-1<YEAR(K4),\"\",EOMONTH(K4,(12-MONTH(K4))))))","v":"2021-12-31"},{"$f":"IF(AND(DAY(K5)=1,YEAR(K5)<>YEAR('Simulation retraite'!$B$24)),DAYS360(K4,K5)-1,DAYS360(K4,K5))","v":360},{"$f":"IF(K5=\"\",\"\",IF(YEAR(K5)=2019,CEILING(N4*Para_simu!$Q$2*L5/360,0.05),IF(YEAR(K5)=2020,CEILING(N4*Para_simu!$Q$3*L5/360,0.05),IF(YEAR(K5)=2021,CEILING(N4*Para_simu!$Q$4*L5/360,0.05),IF(YEAR(K5)=2022,CEILING(N4*Para_simu!$Q$5*L5/360,0.05),CEILING(N4*'Simulation retraite'!$D$41*L5/360,0.05))))))","v":0},{"$f":"IF(K5=\"\",\"\",N4+M5)","v":0}]
[{"$f":"IF(A5=\"\",\"\",IF(YEAR('Simulation retraite'!$B$24)-1=YEAR(A5),'Simulation retraite'!$B$24,IF(YEAR('Simulation retraite'!$B$24)-1<YEAR(A5),\"\",(EDATE(A5,12)))))","v":"2022-12-31"},{"$f":"IF(A6=\"\",\"\",IF(DAY(A6)=1,DAYS360(A5,A6)-1,DAYS360(A5,A6)))","v":360},{"$f":"IF(A6=\"\",\"\",IF(YEAR(A6)=2019,CEILING(D5*Para_simu!$Q$2*B6/360,0.05),IF(YEAR(A6)=2020,CEILING(D5*Para_simu!$Q$3*B6/360,0.05),IF(YEAR(A6)=2021,CEILING(D5*Para_simu!$Q$4*B6/360,0.05),IF(YEAR(A6)=2022,CEILING(D5*Para_simu!$Q$5*B6/360,0.05),CEILING(D5*'Simulation retraite'!$B$41*B6/360,0.05))))))","v":0},{"$f":"IF(A6=\"\",\"\",D5+C6)","v":0},null,{"$f":"IF(F5=\"\",\"\",IF(YEAR('Simulation retraite'!$B$24)-1=YEAR(F5),'Simulation retraite'!$B$24,IF(YEAR('Simulation retraite'!$B$24)-1<YEAR(F5),\"\",(EDATE(F5,12)))))","v":"2022-12-31"},{"$f":"IF(F6=\"\",\"\",IF(DAY(F6)=1,DAYS360(F5,F6)-1,DAYS360(F5,F6)))","v":360},{"$f":"IF(F6=\"\",\"\",IF(YEAR(F6)=2019,CEILING(I5*Para_simu!$Q$2*G6/360,0.05),IF(YEAR(F6)=2020,CEILING(I5*Para_simu!$Q$3*G6/360,0.05),IF(YEAR(F6)=2021,CEILING(I5*Para_simu!$Q$4*G6/360,0.05),IF(YEAR(F6)=2022,CEILING(I5*Para_simu!$Q$5*G6/360,0.05),CEILING(I5*'Simulation retraite'!$C$41*G6/360,0.05))))))","v":0},0,null,{"$f":"IF(K5=\"\",\"\",IF(YEAR('Simulation retraite'!$B$24)-1=YEAR(K5),'Simulation retraite'!$B$24,IF(YEAR('Simulation retraite'!$B$24)-1<YEAR(K5),\"\",(EDATE(K5,12)))))","v":"2022-12-31"},{"$f":"IF(K6=\"\",\"\",IF(DAY(K6)=1,DAYS360(K5,K6)-1,DAYS360(K5,K6)))","v":360},{"$f":"IF(K6=\"\",\"\",IF(YEAR(K6)=2019,CEILING(N5*Para_simu!$Q$2*L6/360,0.05),IF(YEAR(K6)=2020,CEILING(N5*Para_simu!$Q$3*L6/360,0.05),IF(YEAR(K6)=2021,CEILING(N5*Para_simu!$Q$4*L6/360,0.05),IF(YEAR(K6)=2022,CEILING(N5*Para_simu!$Q$5*L6/360,0.05),CEILING(N5*'Simulation retraite'!$D$41*L6/360,0.05))))))","v":0},0]
{"$rows_left_out":49}
{"sheet":"Para_simu","index":3,"n_rows":55,"n_cols":17,"rows_kept":55,"cut":false,"hidden":true,"merged":[]}
["Age","Taux de bonifications Base","Taux de bonifications PPP","Taux de bonifications Base 2024","Taux de bonifications PPP 2024","Taux de bonifications Base - Epargne +","Taux de bonifications PPP - Epargne +","Taux de bonifications Base 2024 - Epargne +","Taux de bonifications PPP 2024 - Epargne +","Age de retraite","Taux de conversion","Sexe","Collectif","Epargne +","Projection","Année","Intérêt"]
[17,0,0,0,0,0,0,0,0,58,4.6199999999999998E-2,"Masculin","Base","non",{"$f":"\"Prestations selon l'hypothèse d'intérêt de \"&TEXT('Simulation retraite'!$B$41,\"0.00%\")","v":"Prestations selon l'hypothèse d'intérêt de 1.00%"},2019,2.2499999999999999E-2]
[18,0,0,0,0,0,0,0,0,59,4.7300000000000002E-2,"Féminin","PPP","oui",{"$f":"\"Prestations selon l'hypothèse d'intérêt de \"&TEXT('Simulation retraite'!$C$41,\"0.00%\")","v":"Prestations selon l'hypothèse d'intérêt de 1.75%"},2020,2.5000000000000001E-2]
[19,0,0,0,0,0,0,0,0,60,4.8500000000000001E-2,null,null,null,{"$f":"\"Prestations selon l'hypothèse d'intérêt de \"&TEXT('Simulation retraite'!$D$41,\"0.00%\")","v":"Prestations selon l'hypothèse d'intérêt de 2.50%"},2021,0.05]
[20,0.13,0.16500000000000001,0.13,0.16500000000000001,{"$f":"B5+1%","v":0.14000000000000001},{"$f":"C5+1%","v":0.17500000000000002},0.14000000000000001,0.17500000000000002,61,4.9700000000000001E-2,null,null,null,null,2022,0.01]
[21,0.13,0.16500000000000001,0.13,0.16500000000000001,{"$f":"B6+1%","v":0.14000000000000001},{"$f":"C6+1%","v":0.17500000000000002},{"$f":"D6+1%","v":0.14000000000000001},{"$f":"E6+1%","v":0.17500000000000002},62,5.11E-2]
{"$rows_left_out":49}